Reaction Details
TargetIsoform 2 of Nuclear receptor ROR-alpha (Alpha-2)
LigandBDBM37016
Substrate/Competitorn/a
Meas. Tech.Counterscreen for inhibitors of the nuclear receptor Steroidogenic Factor 1 (SF-1): A cell-based dose-response assay for inhibition of the RAR-related orphan receptor A (RORA)
IC50 962±n/a nM
Citation PubChem, PC Counterscreen for inhibitors of the nuclear receptor Steroidogenic Factor 1 (SF-1): A cell-based dose-response assay for inhibition of the RAR-related orphan receptor A (RORA) PubChem Bioassay(2007)[AID]
 
Isoform 2 of Nuclear receptor ROR-alpha (Alpha-2)
Name:Isoform 2 of Nuclear receptor ROR-alpha (Alpha-2)
Type:PROTEIN
Mol. Mass.:63033.59
Organism:Homo sapiens (Human)
Description:EBI_101591
Residue:556
BDBM37016
NameBDBM37016
Synonyms:MLS000056239 N-[2-[2-[2,5-dimethyl-1-(thiophen-2-ylmethyl)-3-pyrrolyl]-2-oxoethoxy]phenyl]acetamide N-[2-[2-[2,5-dimethyl-1-(thiophen-2-ylmethyl)pyrrol-3-yl]-2-oxoethoxy]phenyl]acetamide cid_2524461
TypeSmall organic molecule
Emp. Form.C21H22N2O3S
Mol. Mass.382.476
SMILESCC(=O)Nc1ccccc1OCC(=O)c1cc(C)n(Cc2cccs2)c1C