Reaction Details
TargetIsoform 2 of Nuclear receptor ROR-alpha (Alpha-2)
LigandBDBM39063
Substrate/Competitorn/a
Meas. Tech.Counterscreen for inhibitors of the nuclear receptor Steroidogenic Factor 1 (SF-1): A cell-based dose-response assay for inhibition of the RAR-related orphan receptor A (RORA)
IC50 1185±n/a nM
Citation PubChem, PC Counterscreen for inhibitors of the nuclear receptor Steroidogenic Factor 1 (SF-1): A cell-based dose-response assay for inhibition of the RAR-related orphan receptor A (RORA) PubChem Bioassay(2007)[AID]
 
Isoform 2 of Nuclear receptor ROR-alpha (Alpha-2)
Name:Isoform 2 of Nuclear receptor ROR-alpha (Alpha-2)
Type:PROTEIN
Mol. Mass.:63033.59
Organism:Homo sapiens (Human)
Description:EBI_101591
Residue:556
BDBM39063
NameBDBM39063
Synonyms:5-(4-methylphenyl)-3-(2-pyridinyl)-1,2,4-oxadiazole 5-(p-tolyl)-3-(2-pyridyl)-1,2,4-oxadiazole SMR000105486 | cid_763882
TypeSmall organic molecule
Emp. Form.C14H11N3O
Mol. Mass.237.2566
SMILESCc1ccc(cc1)-c1nc(no1)-c1ccccn1