Reaction Details
TargetIsoform 2 of Nuclear receptor ROR-alpha (Alpha-2)
LigandBDBM39072
Substrate/Competitorn/a
Meas. Tech.Counterscreen for inhibitors of the nuclear receptor Steroidogenic Factor 1 (SF-1): A cell-based dose-response assay for inhibition of the RAR-related orphan receptor A (RORA)
IC50 517±n/a nM
Citation PubChem, PC Counterscreen for inhibitors of the nuclear receptor Steroidogenic Factor 1 (SF-1): A cell-based dose-response assay for inhibition of the RAR-related orphan receptor A (RORA) PubChem Bioassay(2007)[AID]
 
Isoform 2 of Nuclear receptor ROR-alpha (Alpha-2)
Name:Isoform 2 of Nuclear receptor ROR-alpha (Alpha-2)
Type:PROTEIN
Mol. Mass.:63033.59
Organism:Homo sapiens (Human)
Description:EBI_101591
Residue:556
BDBM39072
NameBDBM39072
Synonyms:2-(1-propyl-4-pyridinylidene)indene-1,3-dione 2-(1-propylpyridin-4-ylidene)indene-1,3-dione SMR000102657 | cid_793991
TypeSmall organic molecule
Emp. Form.C17H15NO2
Mol. Mass.265.3065
SMILES[#6]-[#6]-[#6]-[#7]-1-[#6]=[#6]\[#6](-[#6]=[#6]-1)=[#6]-1/[#6](=O)-c2ccccc2-[#6]-1=O