Reaction Details
TargetSteroidogenic factor 1
LigandBDBM50293101
Substrate/Competitorn/a
Meas. Tech.Dose-response cell-based assay for inhibitors of the nuclear receptor Steroidogenic Factor 1 (SF-1)
IC50 3520±n/a nM
Citation PubChem, PC Dose-response cell-based assay for inhibitors of the nuclear receptor Steroidogenic Factor 1 (SF-1) PubChem Bioassay(2007)[AID]
 
Steroidogenic factor 1
Name:Steroidogenic factor 1
Type:Nuclear Hormone Receptor
Mol. Mass.:51643.43
Organism:Homo sapiens (Human)
Description:n/a
Residue:461
BDBM50293101
NameBDBM50293101
Synonyms:5-(2,4-dimethoxyphenyl)-3-phenyl-1,2,4-oxadiazole cid_893238
TypeSmall organic molecule
Emp. Form.C16H14N2O3
Mol. Mass.282.294
SMILESCOc1ccc(-c2nc(no2)-c2ccccc2)c(OC)c1