Reaction Details
TargetSteroidogenic factor 1
LigandBDBM39017
Substrate/Competitorn/a
Meas. Tech.Dose-response cell-based assay for inhibitors of the nuclear receptor Steroidogenic Factor 1 (SF-1)
IC50>11000±n/a nM
Citation PubChem, PC Dose-response cell-based assay for inhibitors of the nuclear receptor Steroidogenic Factor 1 (SF-1) PubChem Bioassay(2007)[AID]
 
Steroidogenic factor 1
Name:Steroidogenic factor 1
Type:Nuclear Hormone Receptor
Mol. Mass.:51643.43
Organism:Homo sapiens (Human)
Description:n/a
Residue:461
BDBM39017
NameBDBM39017
Synonyms:(E)-3-[4-(dimethylamino)anilino]-1-phenyl-2-propen-1-one (E)-3-[4-(dimethylamino)anilino]-1-phenylprop-2-en-1-one 3-{[4-(dimethylamino)phenyl]amino}-1-phenyl-2-propen-1-one SMR000072535 | cid_2188632
TypeSmall organic molecule
Emp. Form.C17H18N2O
Mol. Mass.266.3376
SMILESCN(C)c1ccc(cc1)N=CCC(=O)c1ccccc1