Reaction Details
TargetSteroidogenic factor 1
LigandBDBM39056
Substrate/Competitorn/a
Meas. Tech.Dose-response cell-based assay for inhibitors of the nuclear receptor Steroidogenic Factor 1 (SF-1)
IC50<5.03±n/a nM
Citation PubChem, PC Dose-response cell-based assay for inhibitors of the nuclear receptor Steroidogenic Factor 1 (SF-1) PubChem Bioassay(2007)[AID]
 
Steroidogenic factor 1
Name:Steroidogenic factor 1
Type:Nuclear Hormone Receptor
Mol. Mass.:51643.43
Organism:Homo sapiens (Human)
Description:n/a
Residue:461
BDBM39056
NameBDBM39056
Synonyms:1-(4-chlorophenyl)-4-(3-methyl-1-piperidinyl)pyrazolo[3,4-d]pyrimidine 1-(4-chlorophenyl)-4-(3-methylpiperidino)pyrazolo[3,4-d]pyrimidine SMR000017484 | cid_3554231
TypeSmall organic molecule
Emp. Form.C17H18ClN5
Mol. Mass.327.811
SMILESCC1CCCN(C1)c1ncnc2n(ncc12)-c1ccc(Cl)cc1