Reaction Details
TargetIsoform 2 of Nuclear receptor ROR-alpha (Alpha-2)
LigandBDBM32102
Substrate/Competitorn/a
Meas. Tech.Dose-response cell-based assay for inhibitors of the Retinoic Acid Receptor-related orphan receptor A (RORA)
IC50 690±n/a nM
Citation PubChem, PC Dose-response cell-based assay for inhibitors of the Retinoic Acid Receptor-related orphan receptor A (RORA) PubChem Bioassay(2007)[AID]
 
Isoform 2 of Nuclear receptor ROR-alpha (Alpha-2)
Name:Isoform 2 of Nuclear receptor ROR-alpha (Alpha-2)
Type:PROTEIN
Mol. Mass.:63033.59
Organism:Homo sapiens (Human)
Description:EBI_101591
Residue:556
BDBM32102
NameBDBM32102
Synonyms:1,6-dimethylpyrimido[5,4-e][1,2,4]triazine-5,7(1H,6H)-dione 1,6-dimethylpyrimido[5,4-e][1,2,4]triazine-5,7-quinone SMR000024051 US9738628, Compound PKF118-310 | cid_66541
TypeSmall organic molecule
Emp. Form.C7H7N5O2
Mol. Mass.193.1628
SMILESCn1ncnc2c1nc(=O)n(C)c2=O