Reaction Details
TargetIsoform 2 of Nuclear receptor ROR-alpha (Alpha-2)
LigandBDBM39051
Substrate/Competitorn/a
Meas. Tech.Dose-response cell-based assay for inhibitors of the Retinoic Acid Receptor-related orphan receptor A (RORA)
IC50>407±n/a nM
Citation PubChem, PC Dose-response cell-based assay for inhibitors of the Retinoic Acid Receptor-related orphan receptor A (RORA) PubChem Bioassay(2007)[AID]
 
Isoform 2 of Nuclear receptor ROR-alpha (Alpha-2)
Name:Isoform 2 of Nuclear receptor ROR-alpha (Alpha-2)
Type:PROTEIN
Mol. Mass.:63033.59
Organism:Homo sapiens (Human)
Description:EBI_101591
Residue:556
BDBM39051
NameBDBM39051
Synonyms:4-(1-azepanyl)-1-(4-chlorophenyl)pyrazolo[3,4-d]pyrimidine MLS000100816 cid_3702591
TypeSmall organic molecule
Emp. Form.C17H18ClN5
Mol. Mass.327.811
SMILESClc1ccc(cc1)-n1ncc2c(ncnc12)N1CCCCCC1