Reaction Details
TargetIsoform 2 of Nuclear receptor ROR-alpha (Alpha-2)
LigandBDBM39062
Substrate/Competitorn/a
Meas. Tech.Dose-response cell-based assay for inhibitors of the Retinoic Acid Receptor-related orphan receptor A (RORA)
IC50 1195±n/a nM
Citation PubChem, PC Dose-response cell-based assay for inhibitors of the Retinoic Acid Receptor-related orphan receptor A (RORA) PubChem Bioassay(2007)[AID]
 
Isoform 2 of Nuclear receptor ROR-alpha (Alpha-2)
Name:Isoform 2 of Nuclear receptor ROR-alpha (Alpha-2)
Type:PROTEIN
Mol. Mass.:63033.59
Organism:Homo sapiens (Human)
Description:EBI_101591
Residue:556
BDBM39062
NameBDBM39062
Synonyms:2-(1-ethyl-4-pyridinylidene)indene-1,3-dione 2-(1-ethylpyridin-4-ylidene)indene-1,3-dione SMR000102582 | cid_206388
TypeSmall organic molecule
Emp. Form.C16H13NO2
Mol. Mass.251.2799
SMILES[#6]-[#6]-[#7]-1-[#6]=[#6]\[#6](-[#6]=[#6]-1)=[#6]-1\[#6](=O)-c2ccccc2-[#6]-1=O