Reaction Details
TargetIsoform 2 of Nuclear receptor ROR-alpha (Alpha-2)
LigandBDBM39069
Substrate/Competitorn/a
Meas. Tech.Dose-response cell-based assay for inhibitors of the Retinoic Acid Receptor-related orphan receptor A (RORA)
IC50 1524±n/a nM
Citation PubChem, PC Dose-response cell-based assay for inhibitors of the Retinoic Acid Receptor-related orphan receptor A (RORA) PubChem Bioassay(2007)[AID]
 
Isoform 2 of Nuclear receptor ROR-alpha (Alpha-2)
Name:Isoform 2 of Nuclear receptor ROR-alpha (Alpha-2)
Type:PROTEIN
Mol. Mass.:63033.59
Organism:Homo sapiens (Human)
Description:EBI_101591
Residue:556
BDBM39069
NameBDBM39069
Synonyms:(Z)-3-(1,3-benzodioxol-5-ylamino)-1-(2-pyridinyl)-2-propen-1-one (Z)-3-(1,3-benzodioxol-5-ylamino)-1-pyridin-2-yl-prop-2-en-1-one MLS000108346 cid_5310753
TypeSmall organic molecule
Emp. Form.C15H12N2O3
Mol. Mass.268.2674
SMILESO=C(CC=Nc1ccc2OCOc2c1)c1ccccn1