Reaction Details
TargetSteroidogenic factor 1
LigandBDBM38890
Substrate/Competitorn/a
Meas. Tech.Counterscreen for inhibitors of the Retinoic Acid Receptor-related orphan receptor A (RORA): A cell-based dose-response assay for inhibition of the Steroidogenic Factor 1 (SF-1)
IC50 675±n/a nM
Citation PubChem, PC Counterscreen for inhibitors of the Retinoic Acid Receptor-related orphan receptor A (RORA): A cell-based dose-response assay for inhibition of the Steroidogenic Factor 1 (SF-1) PubChem Bioassay(2007)[AID]
 
Steroidogenic factor 1
Name:Steroidogenic factor 1
Type:Nuclear Hormone Receptor
Mol. Mass.:51643.43
Organism:Homo sapiens (Human)
Description:n/a
Residue:461
BDBM38890
NameBDBM38890
Synonyms:4-[[4-(hydroximinomethyl)-2-methoxy-phenoxy]methyl]benzoic acid 4-[[4-(hydroxyiminomethyl)-2-methoxyphenoxy]methyl]benzoic acid MLS000071165 cid_659518
TypeSmall organic molecule
Emp. Form.C16H15NO5
Mol. Mass.301.294
SMILESCOc1cc(CN=O)ccc1OCc1ccc(cc1)C(O)=O