Reaction Details
TargetSteroidogenic factor 1
LigandBDBM31058
Substrate/Competitorn/a
Meas. Tech.Counterscreen for inhibitors of the Retinoic Acid Receptor-related orphan receptor A (RORA): A cell-based dose-response assay for inhibition of the Steroidogenic Factor 1 (SF-1)
IC50 390±n/a nM
Citation PubChem, PC Counterscreen for inhibitors of the Retinoic Acid Receptor-related orphan receptor A (RORA): A cell-based dose-response assay for inhibition of the Steroidogenic Factor 1 (SF-1) PubChem Bioassay(2007)[AID]
 
Steroidogenic factor 1
Name:Steroidogenic factor 1
Type:Nuclear Hormone Receptor
Mol. Mass.:51643.43
Organism:Homo sapiens (Human)
Description:n/a
Residue:461
BDBM31058
NameBDBM31058
Synonyms:3-(2-methoxyphenyl)-6-p-phenetyl-7H-[1,2,4]triazolo[3,4-b][1,3,4]thiadiazine MLS000081448 cid_663143
TypeSmall organic molecule
Emp. Form.C19H18N4O2S
Mol. Mass.366.437
SMILESCCOc1ccc(cc1)C1=Nn2c(SC1)nnc2-c1ccccc1OC