Reaction Details
TargetSteroidogenic factor 1
LigandBDBM38913
Substrate/Competitorn/a
Meas. Tech.Counterscreen for inhibitors of the Retinoic Acid Receptor-related orphan receptor A (RORA): A cell-based dose-response assay for inhibition of the Steroidogenic Factor 1 (SF-1)
IC50 1105±n/a nM
Citation PubChem, PC Counterscreen for inhibitors of the Retinoic Acid Receptor-related orphan receptor A (RORA): A cell-based dose-response assay for inhibition of the Steroidogenic Factor 1 (SF-1) PubChem Bioassay(2007)[AID]
 
Steroidogenic factor 1
Name:Steroidogenic factor 1
Type:Nuclear Hormone Receptor
Mol. Mass.:51643.43
Organism:Homo sapiens (Human)
Description:n/a
Residue:461
BDBM38913
NameBDBM38913
Synonyms:3-[3-(4-tert-butylphenyl)-1,2,4-oxadiazol-5-yl]-N,N-dimethyl-propanamide 3-[3-(4-tert-butylphenyl)-1,2,4-oxadiazol-5-yl]-N,N-dimethylpropanamide SMR000046865 | cid_665578
TypeSmall organic molecule
Emp. Form.C17H23N3O2
Mol. Mass.301.3834
SMILESCN(C)C(=O)CCc1nc(no1)-c1ccc(cc1)C(C)(C)C