Reaction Details
TargetSteroidogenic factor 1
LigandBDBM38943
Substrate/Competitorn/a
Meas. Tech.Counterscreen for inhibitors of the Retinoic Acid Receptor-related orphan receptor A (RORA): A cell-based dose-response assay for inhibition of the Steroidogenic Factor 1 (SF-1)
IC50 728±n/a nM
Citation PubChem, PC Counterscreen for inhibitors of the Retinoic Acid Receptor-related orphan receptor A (RORA): A cell-based dose-response assay for inhibition of the Steroidogenic Factor 1 (SF-1) PubChem Bioassay(2007)[AID]
 
Steroidogenic factor 1
Name:Steroidogenic factor 1
Type:Nuclear Hormone Receptor
Mol. Mass.:51643.43
Organism:Homo sapiens (Human)
Description:n/a
Residue:461
BDBM38943
NameBDBM38943
Synonyms:2-(1,3-benzothiazol-2-yl)-1-phthalazinone MLS000055243 cid_727725
TypeSmall organic molecule
Emp. Form.C15H9N3OS
Mol. Mass.279.316
SMILESO=c1n(ncc2ccccc12)-c1nc2ccccc2s1