Reaction Details
TargetSteroidogenic factor 1
LigandBDBM37025
Substrate/Competitorn/a
Meas. Tech.Counterscreen for inhibitors of the Retinoic Acid Receptor-related orphan receptor A (RORA): A cell-based dose-response assay for inhibition of the Steroidogenic Factor 1 (SF-1)
IC50 1441±n/a nM
Citation PubChem, PC Counterscreen for inhibitors of the Retinoic Acid Receptor-related orphan receptor A (RORA): A cell-based dose-response assay for inhibition of the Steroidogenic Factor 1 (SF-1) PubChem Bioassay(2007)[AID]
 
Steroidogenic factor 1
Name:Steroidogenic factor 1
Type:Nuclear Hormone Receptor
Mol. Mass.:51643.43
Organism:Homo sapiens (Human)
Description:n/a
Residue:461
BDBM37025
NameBDBM37025
Synonyms:4-[4-[2-(4-chloranylphenoxy)ethyl]piperazin-1-yl]thieno[2,3-d]pyrimidine 4-[4-[2-(4-chlorophenoxy)ethyl]piperazin-1-yl]thieno[2,3-d]pyrimidine MLS000056574 cid_2537908
TypeSmall organic molecule
Emp. Form.C18H19ClN4OS
Mol. Mass.374.888
SMILESClc1ccc(OCCN2CCN(CC2)c2ncnc3sccc23)cc1