Reaction Details
TargetSteroidogenic factor 1
LigandBDBM39001
Substrate/Competitorn/a
Meas. Tech.Counterscreen for inhibitors of the Retinoic Acid Receptor-related orphan receptor A (RORA): A cell-based dose-response assay for inhibition of the Steroidogenic Factor 1 (SF-1)
IC50 274±n/a nM
Citation PubChem, PC Counterscreen for inhibitors of the Retinoic Acid Receptor-related orphan receptor A (RORA): A cell-based dose-response assay for inhibition of the Steroidogenic Factor 1 (SF-1) PubChem Bioassay(2007)[AID]
 
Steroidogenic factor 1
Name:Steroidogenic factor 1
Type:Nuclear Hormone Receptor
Mol. Mass.:51643.43
Organism:Homo sapiens (Human)
Description:n/a
Residue:461
BDBM39001
NameBDBM39001
Synonyms:3-[(4-ethoxyphenoxy)methyl]benzoic acid SMR000072768 | cid_891145
TypeSmall organic molecule
Emp. Form.C16H16O4
Mol. Mass.272.2958
SMILESCCOc1ccc(OCc2cccc(c2)C(O)=O)cc1