Reaction Details
TargetBcl-2-related protein A1
LigandBDBM30709
Substrate/Competitorn/a
Meas. Tech.TR-FRET secondary assay for HTS discovery of chemical inhibitors of anti-apoptotic protein Bfl-1
IC50>100000±0 nM
Citation PubChem, PC TR-FRET secondary assay for HTS discovery of chemical inhibitors of anti-apoptotic protein Bfl-1 PubChem Bioassay(2008)[AID]
 
Bcl-2-related protein A1
Name:Bcl-2-related protein A1
Type:Apoptosis regulator protein
Mol. Mass.:19909.74
Organism:Mus musculus (Mouse)
Description:gi_11024684
Residue:172
BDBM30709
NameBDBM30709
Synonyms:ERGOCORNINE SMR000058938 | cid_73453
TypeSmall organic molecule
Emp. Form.C31H39N5O5
Mol. Mass.561.6719
SMILES[H][C@@]12CCCN1C(=O)[C@H](C(C)C)N1C(=O)[C@](NC(=O)[C@H]3CN(C)[C@]4([H])Cc5c[nH]c6cccc(C4=C3)c56)(O[C@@]21O)C(C)C