Reaction Details
TargetBcl-2-related protein A1
LigandBDBM32050
Substrate/Competitorn/a
Meas. Tech.TR-FRET secondary assay for HTS discovery of chemical inhibitors of anti-apoptotic protein Bfl-1
IC50>100000±0 nM
Citation PubChem, PC TR-FRET secondary assay for HTS discovery of chemical inhibitors of anti-apoptotic protein Bfl-1 PubChem Bioassay(2008)[AID]
 
Bcl-2-related protein A1
Name:Bcl-2-related protein A1
Type:Apoptosis regulator protein
Mol. Mass.:19909.74
Organism:Mus musculus (Mouse)
Description:gi_11024684
Residue:172
BDBM32050
NameBDBM32050
Synonyms:MLS000080844 cid_663844
TypeSmall organic molecule
Emp. Form.C20H16N4O2
Mol. Mass.344.3666
SMILESO=C1c2ccccc2-c2onc3ccc(NCCCn4ccnc4)c1c23