Reaction Details
TargetM-phase inducer phosphatase 2
LigandBDBM31757
Substrate/Competitorn/a
Meas. Tech.Cdc25B Catalytic Domain Protein Tyrosine Phosphatase Probe Assessment Dose Response assay in 25 mM DTT
IC50 12812.99973±n/a nM
Citation PubChem, PC Cdc25B Catalytic Domain Protein Tyrosine Phosphatase Probe Assessment Dose Response assay in 25 mM DTT PubChem Bioassay(2007)[AID]
 
M-phase inducer phosphatase 2
Name:M-phase inducer phosphatase 2
Type:Protein
Mol. Mass.:64985.27
Organism:Homo sapiens (Human)
Description:n/a
Residue:580
BDBM31757
NameBDBM31757
Synonyms:6-hydroxy-3a,4,5,9b-tetrahydro-3H-cyclopenta[c]quinoline-4-carboxylic acid MLS-0015717.0001 | cid_654089
TypeSmall organic molecule
Emp. Form.C13H13NO3
Mol. Mass.231.2472
SMILESOC(=O)C1Nc2c(O)cccc2C2C=CCC12