Reaction Details
TargetGenome polyprotein
LigandBDBM39342
Substrate/Competitorn/a
Meas. Tech.West Nile Virus NS2bNS3 Proteinase Inhibitor Dose Response Confirmation.
IC50>50000±n/a nM
Citation PubChem, PC West Nile Virus NS2bNS3 Proteinase Inhibitor Dose Response Confirmation. PubChem Bioassay(2007)[AID]
 
Genome polyprotein
Name:Genome polyprotein
Type:PROTEIN
Mol. Mass.:380170.63
Organism:West Nile virus
Description:ChEMBL_1438217
Residue:3430
BDBM39342
NameBDBM39342
Synonyms:2-aminocarbonyloxypropyl(trimethyl)azanium;chloride 2-carbamoyloxypropyl(trimethyl)azanium;chloride BETHANECHOL CHLORIDE Hermes, Myo Myotonine cid_11548
TypeSmall organic molecule
Emp. Form.C7H17N2O2
Mol. Mass.161.2215
SMILESCC(C[N+](C)(C)C)OC(N)=O