Reaction Details
TargetDual specificity protein phosphatase 1
LigandBDBM34163
Substrate/Competitorn/a
Meas. Tech.Cdc25B Catalytic Domain Protein Tyrosine Phosphatase Probe Assessment: MKP-1 Dose Response Selectivity comparison.
IC50 2379±n/a nM
Citation PubChem, PC Cdc25B Catalytic Domain Protein Tyrosine Phosphatase Probe Assessment: MKP-1 Dose Response Selectivity comparison. PubChem Bioassay(2007)[AID]
 
Dual specificity protein phosphatase 1
Name:Dual specificity protein phosphatase 1
Type:Protein phosphatase
Mol. Mass.:39301.48
Organism:Homo sapiens (Human)
Description:gi_4758204
Residue:367
BDBM34163
NameBDBM34163
Synonyms:3-Amino-7-benzyl-1-thioxo-5,6,7,8-tetrahydro-1H-thiopyrano[3,4-c]pyridine-4-carbonitrile 3-amino-7-benzyl-1-sulfanylidene-6,8-dihydro-5H-thiopyrano[3,4-c]pyridine-4-carbonitrile 3-azanyl-7-(phenylmethyl)-1-sulfanylidene-6,8-dihydro-5H-thiopyrano[3,4-c]pyridine-4-carbonitrile SMR000011772 | cid_787437
TypeSmall organic molecule
Emp. Form.C16H15N3S2
Mol. Mass.313.44
SMILESNc1sc(=S)c2CN(Cc3ccccc3)CCc2c1C#N