Reaction Details
TargetM-phase inducer phosphatase 2
LigandBDBM22851
Substrate/Competitorn/a
Meas. Tech.MKP-1 Dual Specificity Protein Tyrosine Phosphatase Probe Assessment: Cdc25B Dose Response Selectivity Assay
IC50 19022±n/a nM
Citation PubChem, PC MKP-1 Dual Specificity Protein Tyrosine Phosphatase Probe Assessment: Cdc25B Dose Response Selectivity Assay PubChem Bioassay(2007)[AID]
 
M-phase inducer phosphatase 2
Name:M-phase inducer phosphatase 2
Type:Protein
Mol. Mass.:64985.27
Organism:Homo sapiens (Human)
Description:n/a
Residue:580
BDBM22851
NameBDBM22851
Synonyms:1,2-Dione-Based Compound, 8 1,2-naphthoquinone cid_10667
TypeSmall organic molecule
Emp. Form.C10H6O2
Mol. Mass.158.1534
SMILESO=C1C=Cc2ccccc2C1=O