Reaction Details
TargetGlycogen phosphorylase, liver form
LigandBDBM50136446
Substrate/Competitorn/a
Meas. Tech.Inhibition Activity Assay
pH7.2±0
Temperature295.15±0 K
IC50 45±0.0 nM
Citation Rath, VLAmmirati, MDanley, DEEkstrom, JLGibbs, EMHynes, TRMathiowetz, AMMcPherson, RKOlson, TVTreadway, JLHoover, DJ Human liver glycogen phosphorylase inhibitors bind at a new allosteric site. Chem Biol7:677-82 (2000) 
 
Glycogen phosphorylase, liver form
Name:Glycogen phosphorylase, liver form
Type:Homodimer
Mol. Mass.:97153.98
Organism:Homo sapiens (Human)
Description:Dimers associate into a tetramer to form the enzymatically active phosphorylase A.
Residue:847
BDBM50136446
NameBDBM50136446
Synonyms:1-{(S)-2-[(5-Chloro-1H-indole-2-carbonyl)-amino]-3-phenyl-propionyl}-azetidine-3-carboxylic acid CP-403,700 [5-CHLORO-1H-INDOL-2-CARBONYL-PHENYLALANINYL]-AZETIDINE-3-CARBOXYLIC ACID
TypeSmall organic molecule
Emp. Form.C22H20ClN3O4
Mol. Mass.425.865
SMILESOC(=O)C1CN(C1)C(=O)[C@H](Cc1ccccc1)NC(=O)c1cc2cc(Cl)ccc2[nH]1