Reaction Details
TargetBeta-lactamase
LigandBDBM39816
Substrate/Competitorn/a
Meas. Tech.Enzyme Inhibition Assay
pH7±0
Ki 3.9e+2±n/a nM
Citation Caselli, EPowers, RABlasczcak, LCWu, CYPrati, FShoichet, BK Energetic, structural, and antimicrobial analyses of beta-lactam side chain recognition by beta-lactamases. Chem Biol8:17-31 (2001) 
 
Beta-lactamase
Name:Beta-lactamase
Type:PROTEIN
Mol. Mass.:31367.53
Organism:Staphylococcus aureus
Description:ChEMBL_41052
Residue:281
BDBM39816
NameBDBM39816
Synonyms:Acylglycineboronic acid, 15
TypeSmall organic molecule
Emp. Form.C10H13BN3O6S2
Mol. Mass.346.168
SMILESCC(C)(O\N=C(\C(=O)NCB(O)O)c1csc(S)n1)C([O-])=O