Reaction Details
TargetBeta-lactamase
LigandBDBM39817
Substrate/Competitorn/a
Meas. Tech.Enzyme Inhibition Assay
pH7±0
Ki 1.500e+6±n/a nM
Citation Caselli, EPowers, RABlasczcak, LCWu, CYPrati, FShoichet, BK Energetic, structural, and antimicrobial analyses of beta-lactam side chain recognition by beta-lactamases. Chem Biol8:17-31 (2001) 
 
Beta-lactamase
Name:Beta-lactamase
Type:PROTEIN
Mol. Mass.:31367.53
Organism:Staphylococcus aureus
Description:ChEMBL_41052
Residue:281
BDBM39817
NameBDBM39817
Synonyms:Boric acid | Boronic Acid
TypeSmall organic molecule
Emp. Form.BH3O3
Mol. Mass.61.833
SMILESOB(O)O