Reaction Details
TargetBeta-lactamase
LigandBDBM39818
Substrate/Competitorn/a
Meas. Tech.Enzyme Inhibition Assay
pH7±0
Ki 2.500e+6±n/a nM
Citation Caselli, EPowers, RABlasczcak, LCWu, CYPrati, FShoichet, BK Energetic, structural, and antimicrobial analyses of beta-lactam side chain recognition by beta-lactamases. Chem Biol8:17-31 (2001) 
 
Beta-lactamase
Name:Beta-lactamase
Type:PROTEIN
Mol. Mass.:31367.53
Organism:Staphylococcus aureus
Description:ChEMBL_41052
Residue:281
BDBM39818
NameBDBM39818
Synonyms:Methylboronic Acid
TypeSmall organic molecule
Emp. Form.CH5BO2
Mol. Mass.59.86
SMILESCB(O)O