Reaction Details
TargetBeta-lactamase
LigandBDBM39821
Substrate/Competitorn/a
Meas. Tech.Inhibition Assay
pH7±0
Ki 5.3e+2±n/a nM
Citation Tondi, DPowers, RACaselli, ENegri, MCBlázquez, JCosti, MPShoichet, BK Structure-based design and in-parallel synthesis of inhibitors of AmpC beta-lactamase. Chem Biol8:593-611 (2001) 
 
Beta-lactamase
Name:Beta-lactamase
Type:Protien
Mol. Mass.:41561.62
Organism:Escherichia coli
Description:P00811
Residue:377
BDBM39821
NameBDBM39821
Synonyms:Amide and sulfonamide derivatives, 5
TypeSmall organic molecule
Emp. Form.C20H21BN4O4S
Mol. Mass.424.281
SMILESCN(C)c1ccc(cc1)\N=N\c1ccc(cc1)S(=O)(=O)Nc1cccc(c1)B(O)O