Reaction Details
TargetBeta-lactamase
LigandBDBM39822
Substrate/Competitorn/a
Meas. Tech.Inhibition Assay
pH7±0
Ki 6.6e+2±n/a nM
Citation Tondi, DPowers, RACaselli, ENegri, MCBlázquez, JCosti, MPShoichet, BK Structure-based design and in-parallel synthesis of inhibitors of AmpC beta-lactamase. Chem Biol8:593-611 (2001) 
 
Beta-lactamase
Name:Beta-lactamase
Type:Protien
Mol. Mass.:41561.62
Organism:Escherichia coli
Description:P00811
Residue:377
BDBM39822
NameBDBM39822
Synonyms:Amide and sulfonamide derivatives, 6
TypeSmall organic molecule
Emp. Form.C15H13BN2O4S
Mol. Mass.328.151
SMILESOB(O)c1cccc(NS(=O)(=O)c2cccc3cccnc23)c1