Reaction Details
TargetBeta-lactamase
LigandBDBM39823
Substrate/Competitorn/a
Meas. Tech.Inhibition Assay
pH7±0
Ki 7.0e+2±n/a nM
Citation Tondi, DPowers, RACaselli, ENegri, MCBlázquez, JCosti, MPShoichet, BK Structure-based design and in-parallel synthesis of inhibitors of AmpC beta-lactamase. Chem Biol8:593-611 (2001) 
 
Beta-lactamase
Name:Beta-lactamase
Type:Protien
Mol. Mass.:41561.62
Organism:Escherichia coli
Description:P00811
Residue:377
BDBM39823
NameBDBM39823
Synonyms:Amide and sulfonamide derivatives, 7
TypeSmall organic molecule
Emp. Form.C13H11BF3NO5S
Mol. Mass.361.101
SMILESOB(O)c1cccc(NS(=O)(=O)c2ccc(OC(F)(F)F)cc2)c1