Reaction Details
TargetBeta-lactamase
LigandBDBM39857
Substrate/Competitorn/a
Meas. Tech.Inhibition Assay
pH7±0
Ki 3.4e+2±n/a nM
Citation Tondi, DPowers, RACaselli, ENegri, MCBlázquez, JCosti, MPShoichet, BK Structure-based design and in-parallel synthesis of inhibitors of AmpC beta-lactamase. Chem Biol8:593-611 (2001) 
 
Beta-lactamase
Name:Beta-lactamase
Type:Protien
Mol. Mass.:41561.62
Organism:Escherichia coli
Description:P00811
Residue:377
BDBM39857
NameBDBM39857
Synonyms:Amide and sulfonamide derivatives, 42
TypeSmall organic molecule
Emp. Form.C19H17BN2O8S2
Mol. Mass.476.288
SMILESOB(O)c1cccc(NS(=O)(=O)c2ccc(NS(=O)(=O)c3ccc(cc3)C(O)=O)cc2)c1