Reaction Details
TargetEstrogen receptor
LigandBDBM50022309
Substrate/Competitorn/a
Meas. Tech.Estrogen Receptor-alpha Coactivator Binding Inhibitors Dose Response Confirmation
IC50>50000±n/a nM
Citation PubChem, PC Estrogen Receptor-alpha Coactivator Binding Inhibitors Dose Response Confirmation PubChem Bioassay(2007)[AID]
 
Estrogen receptor
Name:Estrogen receptor
Type:Protein
Mol. Mass.:66230.44
Organism:Homo sapiens (Human)
Description:P03372
Residue:595
BDBM50022309
NameBDBM50022309
Synonyms:3,5-Dioxo-1,2-diphenyl-4-n-butylpyrazolidine 4-n-Butyl-1,2-diphenyl-3,5-pyrazolidinedione PHENYLBUTAZONE | Phenylbutazon
TypeSmall organic molecule
Emp. Form.C19H20N2O2
Mol. Mass.308.3743
SMILESCCCCc1c(O)n(-c2ccccc2)n(-c2ccccc2)c1=O