Reaction Details
TargetMothers against decapentaplegic homolog 3
LigandBDBM31691
Substrate/Competitorn/a
Meas. Tech.SMAD Transcription Factor Inhibitors Dose Response Confirmation
IC50 9462±n/a nM
Citation PubChem, PC SMAD Transcription Factor Inhibitors Dose Response Confirmation PubChem Bioassay(2007)[AID]
 
Mothers against decapentaplegic homolog 3
Name:Mothers against decapentaplegic homolog 3
Type:Enzyme Catalytic Domain
Mol. Mass.:48085.78
Organism:Homo sapiens (Human)
Description:gi_5174513
Residue:425
BDBM31691
NameBDBM31691
Synonyms:3-Methoxy-N-(9-phenylcarbamoylmethyl-9-aza-bicyclo[3.3.1]non-3-yl)-benzamide MLS000030189 N-[9-(2-anilino-2-oxoethyl)-9-azabicyclo[3.3.1]nonan-3-yl]-3-methoxybenzamide;hydrochloride cid_6602529
TypeSmall organic molecule
Emp. Form.C24H29N3O3
Mol. Mass.407.5054
SMILES[H]C12CCCC([H])(CC(C1)NC(=O)c1cccc(OC)c1)N2CC(=O)Nc1ccccc1