Reaction Details
TargetMothers against decapentaplegic homolog 3
LigandBDBM40307
Substrate/Competitorn/a
Meas. Tech.SMAD Transcription Factor Inhibitors Dose Response Confirmation
IC50 11110±n/a nM
Citation PubChem, PC SMAD Transcription Factor Inhibitors Dose Response Confirmation PubChem Bioassay(2007)[AID]
 
Mothers against decapentaplegic homolog 3
Name:Mothers against decapentaplegic homolog 3
Type:Enzyme Catalytic Domain
Mol. Mass.:48085.78
Organism:Homo sapiens (Human)
Description:gi_5174513
Residue:425
BDBM40307
NameBDBM40307
Synonyms:MLS000046472 N-[3-(1-azepanyl)propyl]-1-[2-(4-methylphenyl)ethyl]-5-oxo-3-pyrrolidinecarboxamide N-[3-(azepan-1-yl)propyl]-1-[2-(4-methylphenyl)ethyl]-5-oxopyrrolidine-3-carboxamide SMR000032483 | cid_3237466
TypeSmall organic molecule
Emp. Form.C23H35N3O2
Mol. Mass.385.5429
SMILESCc1ccc(CCN2CC(CC2=O)C(=O)NCCCN2CCCCCC2)cc1