Reaction Details
TargetMothers against decapentaplegic homolog 3
LigandBDBM50099737
Substrate/Competitorn/a
Meas. Tech.SMAD Transcription Factor Inhibitors Dose Response Confirmation
IC50 9894±n/a nM
Citation PubChem, PC SMAD Transcription Factor Inhibitors Dose Response Confirmation PubChem Bioassay(2007)[AID]
 
Mothers against decapentaplegic homolog 3
Name:Mothers against decapentaplegic homolog 3
Type:Enzyme Catalytic Domain
Mol. Mass.:48085.78
Organism:Homo sapiens (Human)
Description:gi_5174513
Residue:425
BDBM50099737
NameBDBM50099737
Synonyms:2-Amino-phenanthrene-9,10-dione US9073941, 902 | cid_254021
TypeSmall organic molecule
Emp. Form.C14H9NO2
Mol. Mass.223.2268
SMILESNc1ccc-2c(c1)C(=O)C(=O)c1ccccc-21