Reaction Details
TargetMothers against decapentaplegic homolog 3
LigandBDBM40323
Substrate/Competitorn/a
Meas. Tech.SMAD Transcription Factor Inhibitors Dose Response Confirmation
IC50 14120±n/a nM
Citation PubChem, PC SMAD Transcription Factor Inhibitors Dose Response Confirmation PubChem Bioassay(2007)[AID]
 
Mothers against decapentaplegic homolog 3
Name:Mothers against decapentaplegic homolog 3
Type:Enzyme Catalytic Domain
Mol. Mass.:48085.78
Organism:Homo sapiens (Human)
Description:gi_5174513
Residue:425
BDBM40323
NameBDBM40323
Synonyms:MLS000564159 N-[bis(diethylamino)phosphoryl]-2,2,2-trichloroacetamide;neodymium(3+);trichloride SMR000151691 | cid_9551987
TypeSmall organic molecule
Emp. Form.C10H21Cl3N3O2P
Mol. Mass.352.625
SMILESCCN(CC)P(=O)(NC(=O)C(Cl)(Cl)Cl)N(CC)CC