Reaction Details
TargetN-formyl peptide receptor 2
LigandBDBM40403
Substrate/Competitorn/a
Meas. Tech.Formylpeptide Receptor (FPR) Ligand Structure Activity Relationship (SAR) Analysis : Dose Response Assay Counterscreen Against Formyl Peptide Receptor-Like-1 (FPRL1)
Ki>40300±n/a nM
Citation PubChem, PC Formylpeptide Receptor (FPR) Ligand Structure Activity Relationship (SAR) Analysis : Dose Response Assay Counterscreen Against Formyl Peptide Receptor-Like-1 (FPRL1)  PubChem Bioassay(2007)[AID]
 
N-formyl peptide receptor 2
Name:N-formyl peptide receptor 2
Type:G Protein-Coupled Receptor (GPCR)
Mol. Mass.:38968.35
Organism:Homo sapiens (Human)
Description:P25090
Residue:351
BDBM40403
NameBDBM40403
Synonyms:2-[(4-bromoanilino)-oxomethyl]-1-cyclohexanecarboxylic acid 2-[(4-bromophenyl)carbamoyl]cyclohexanecarboxylic acid cid_306178
TypeSmall organic molecule
Emp. Form.C14H16BrNO3
Mol. Mass.326.186
SMILESOC(=O)C1CCCCC1C(=O)Nc1ccc(Br)cc1