Reaction Details
TargetN-formyl peptide receptor 2
LigandBDBM40412
Substrate/Competitorn/a
Meas. Tech.Formylpeptide Receptor (FPR) Ligand Structure Activity Relationship (SAR) Analysis : Dose Response Assay Counterscreen Against Formyl Peptide Receptor-Like-1 (FPRL1)
Ki>40300±n/a nM
Citation PubChem, PC Formylpeptide Receptor (FPR) Ligand Structure Activity Relationship (SAR) Analysis : Dose Response Assay Counterscreen Against Formyl Peptide Receptor-Like-1 (FPRL1)  PubChem Bioassay(2007)[AID]
 
N-formyl peptide receptor 2
Name:N-formyl peptide receptor 2
Type:G Protein-Coupled Receptor (GPCR)
Mol. Mass.:38968.35
Organism:Homo sapiens (Human)
Description:P25090
Residue:351
BDBM40412
NameBDBM40412
Synonyms:3-pyridinecarboxylic acid [3-(3,4-dimethoxyphenyl)-4-oxo-2-(trifluoromethyl)-1-benzopyran-7-yl] ester [3-(3,4-dimethoxyphenyl)-4-oxidanylidene-2-(trifluoromethyl)chromen-7-yl] pyridine-3-carboxylate cid_1181136 | nicotinic acid [3-(3,4-dimethoxyphenyl)-4-keto-2-(trifluoromethyl)chromen-7-yl] ester
TypeSmall organic molecule
Emp. Form.C24H16F3NO6
Mol. Mass.471.3821
SMILESCOc1ccc(cc1OC)-c1c(oc2cc(OC(=O)c3cccnc3)ccc2c1=O)C(F)(F)F