Reaction Details
TargetN-formyl peptide receptor 2
LigandBDBM40457
Substrate/Competitorn/a
Meas. Tech.Formylpeptide Receptor (FPR) Ligand Structure Activity Relationship (SAR) Analysis : Dose Response Assay Counterscreen Against Formyl Peptide Receptor-Like-1 (FPRL1)
IC50>66700±n/a nM
Citation PubChem, PC Formylpeptide Receptor (FPR) Ligand Structure Activity Relationship (SAR) Analysis : Dose Response Assay Counterscreen Against Formyl Peptide Receptor-Like-1 (FPRL1)  PubChem Bioassay(2007)[AID]
 
N-formyl peptide receptor 2
Name:N-formyl peptide receptor 2
Type:G Protein-Coupled Receptor (GPCR)
Mol. Mass.:38968.35
Organism:Homo sapiens (Human)
Description:P25090
Residue:351
BDBM40457
NameBDBM40457
Synonyms:3-(4-chlorophenyl)-5-methyl-6-(phenylmethyl)-2-(trifluoromethyl)-1H-pyrazolo[1,5-a]pyrimidin-7-one CHEMBL522818 cid_2211071
TypeSmall organic molecule
Emp. Form.C21H15ClF3N3O
Mol. Mass.417.812
SMILESCc1nc2c(c([nH]n2c(=O)c1Cc1ccccc1)C(F)(F)F)-c1ccc(Cl)cc1