Reaction Details
TargetfMet-Leu-Phe receptor
LigandBDBM40415
Substrate/Competitorn/a
Meas. Tech.Formylpeptide Receptor (FPR) Ligand Structure Activity Relationship (SAR) Analysis : Dose Response Assay
Ki 2500±n/a nM
Citation PubChem, PC Formylpeptide Receptor (FPR) Ligand Structure Activity Relationship (SAR) Analysis : Dose Response Assay PubChem Bioassay(2007)[AID]
 
fMet-Leu-Phe receptor
Name:fMet-Leu-Phe receptor
Type:Enzyme Catalytic Domain
Mol. Mass.:38456.14
Organism:Homo sapiens (Human)
Description:gi_4503779
Residue:350
BDBM40415
NameBDBM40415
Synonyms:2-furancarboxylic acid [3-(2-chlorophenyl)-4-oxo-2-(trifluoromethyl)-1-benzopyran-7-yl] ester [3-(2-chlorophenyl)-4-oxidanylidene-2-(trifluoromethyl)chromen-7-yl] furan-2-carboxylate cid_1036526 | furan-2-carboxylic acid [3-(2-chlorophenyl)-4-keto-2-(trifluoromethyl)chromen-7-yl] ester
TypeSmall organic molecule
Emp. Form.C21H10ClF3O5
Mol. Mass.434.749
SMILESFC(F)(F)c1oc2cc(OC(=O)c3ccco3)ccc2c(=O)c1-c1ccccc1Cl