Reaction Details
TargetfMet-Leu-Phe receptor
LigandBDBM40419
Substrate/Competitorn/a
Meas. Tech.Formylpeptide Receptor (FPR) Ligand Structure Activity Relationship (SAR) Analysis : Dose Response Assay
Ki 3400±n/a nM
Citation PubChem, PC Formylpeptide Receptor (FPR) Ligand Structure Activity Relationship (SAR) Analysis : Dose Response Assay PubChem Bioassay(2007)[AID]
 
fMet-Leu-Phe receptor
Name:fMet-Leu-Phe receptor
Type:Enzyme Catalytic Domain
Mol. Mass.:38456.14
Organism:Homo sapiens (Human)
Description:gi_4503779
Residue:350
BDBM40419
NameBDBM40419
Synonyms:(4E)-5-(2,4-dimethoxyphenyl)-1-(3-imidazol-1-ylpropyl)-4-[oxidanyl(phenyl)methylidene]pyrrolidine-2,3-dione (4E)-5-(2,4-dimethoxyphenyl)-4-[hydroxy(phenyl)methylidene]-1-(3-imidazol-1-ylpropyl)pyrrolidine-2,3-dione UNM000003552201 | cid_5941053
TypeSmall organic molecule
Emp. Form.C25H25N3O5
Mol. Mass.447.4831
SMILESCOc1ccc(C2C(C(=O)c3ccccc3)C(=O)C(=O)N2CCCn2ccnc2)c(OC)c1