Reaction Details
TargetNuclear receptor subfamily 4 group A member 1
LigandBDBM31750
Substrate/Competitorn/a
Meas. Tech.High Throughput Fluorescence Polarization Screen for Bcl-B Phenotype Converters
IC50 19357±772 nM
Citation PubChem, PC High Throughput Fluorescence Polarization Screen for Bcl-B Phenotype Converters PubChem Bioassay(2008)[AID]
 
Nuclear receptor subfamily 4 group A member 1
Name:Nuclear receptor subfamily 4 group A member 1
Type:Enzyme Catalytic Domain
Mol. Mass.:64467.13
Organism:Homo sapiens (Human)
Description:gi_27894344
Residue:598
BDBM31750
NameBDBM31750
Synonyms:5,6-bis(2-furanyl)-3-(methylthio)-1,2,4-triazine 5,6-bis(furan-2-yl)-3-methylsulfanyl-1,2,4-triazine cid_3053058
TypeSmall organic molecule
Emp. Form.C12H9N3O2S
Mol. Mass.259.284
SMILESCSc1nnc(-c2ccco2)c(n1)-c1ccco1