Reaction Details
TargetNuclear receptor subfamily 4 group A member 1
LigandBDBM31698
Substrate/Competitorn/a
Meas. Tech.High Throughput Fluorescence Polarization Screen for Bcl-B Phenotype Converters
IC50 6544±534 nM
Citation PubChem, PC High Throughput Fluorescence Polarization Screen for Bcl-B Phenotype Converters PubChem Bioassay(2008)[AID]
 
Nuclear receptor subfamily 4 group A member 1
Name:Nuclear receptor subfamily 4 group A member 1
Type:Enzyme Catalytic Domain
Mol. Mass.:64467.13
Organism:Homo sapiens (Human)
Description:gi_27894344
Residue:598
BDBM31698
NameBDBM31698
Synonyms:3-bromanyl-5-(3,3-dimethylpiperidin-1-yl)carbonyl-pyran-2-one 3-bromo-5-[(3,3-dimethyl-1-piperidinyl)-oxomethyl]-2-pyranone SMR000044848 | cid_664033
TypeSmall organic molecule
Emp. Form.C13H16BrNO3
Mol. Mass.314.175
SMILESCC1(C)CCCN(C1)C(=O)c1coc(=O)c(Br)c1