Reaction Details
TargetN-formyl peptide receptor 2
LigandBDBM40747
Substrate/Competitorn/a
Meas. Tech.Formylpeptide Receptor (FPRL1) Ligand Structure Activity Relationship (SAR) Analysis : Dose Response Assay
Ki>25100±n/a nM
Citation PubChem, PC Formylpeptide Receptor (FPRL1) Ligand Structure Activity Relationship (SAR) Analysis : Dose Response Assay PubChem Bioassay(2007)[AID]
 
N-formyl peptide receptor 2
Name:N-formyl peptide receptor 2
Type:G Protein-Coupled Receptor (GPCR)
Mol. Mass.:38968.35
Organism:Homo sapiens (Human)
Description:P25090
Residue:351
BDBM40747
NameBDBM40747
Synonyms:2-(4-benzhydrylpiperazin-1-yl)-4-(3,4-dimethoxyphenyl)-6-(trifluoromethyl)pyrimidine 4-(3,4-dimethoxyphenyl)-2-[4-(diphenylmethyl)-1-piperazinyl]-6-(trifluoromethyl)pyrimidine UNM000003655001 | cid_16061387
TypeSmall organic molecule
Emp. Form.C30H29F3N4O2
Mol. Mass.534.5721
SMILESCOc1ccc(cc1OC)-c1cc(nc(n1)N1CCN(CC1)C(c1ccccc1)c1ccccc1)C(F)(F)F