Reaction Details
TargetN-formyl peptide receptor 2
LigandBDBM40750
Substrate/Competitorn/a
Meas. Tech.Formylpeptide Receptor (FPRL1) Ligand Structure Activity Relationship (SAR) Analysis : Dose Response Assay
Ki 2200±n/a nM
Citation PubChem, PC Formylpeptide Receptor (FPRL1) Ligand Structure Activity Relationship (SAR) Analysis : Dose Response Assay PubChem Bioassay(2007)[AID]
 
N-formyl peptide receptor 2
Name:N-formyl peptide receptor 2
Type:G Protein-Coupled Receptor (GPCR)
Mol. Mass.:38968.35
Organism:Homo sapiens (Human)
Description:P25090
Residue:351
BDBM40750
NameBDBM40750
Synonyms:N-(5-imidazo[1,2-a]pyrimidin-2-yl-2-methoxy-phenyl)-2-methyl-propanamide N-(5-imidazo[1,2-a]pyrimidin-2-yl-2-methoxyphenyl)-2-methylpropanamide UNM000003657701 | cid_6622773
TypeSmall organic molecule
Emp. Form.C17H18N4O2
Mol. Mass.310.3504
SMILESCOc1ccc(cc1NC(=O)C(C)C)-c1cn2cccnc2n1