Reaction Details
TargetN-formyl peptide receptor 2
LigandBDBM40755
Substrate/Competitorn/a
Meas. Tech.Formylpeptide Receptor (FPRL1) Ligand Structure Activity Relationship (SAR) Analysis : Dose Response Assay
Ki 3200±n/a nM
Citation PubChem, PC Formylpeptide Receptor (FPRL1) Ligand Structure Activity Relationship (SAR) Analysis : Dose Response Assay PubChem Bioassay(2007)[AID]
 
N-formyl peptide receptor 2
Name:N-formyl peptide receptor 2
Type:G Protein-Coupled Receptor (GPCR)
Mol. Mass.:38968.35
Organism:Homo sapiens (Human)
Description:P25090
Residue:351
BDBM40755
NameBDBM40755
Synonyms:2-(4-chlorophenyl)-N-(5-imidazo[1,2-a]pyrimidin-2-yl-2-methoxy-phenyl)acetamide 2-(4-chlorophenyl)-N-(5-imidazo[1,2-a]pyrimidin-2-yl-2-methoxyphenyl)acetamide UNM000003662001 | cid_7080290
TypeSmall organic molecule
Emp. Form.C21H17ClN4O2
Mol. Mass.392.838
SMILESCOc1ccc(cc1NC(=O)Cc1ccc(Cl)cc1)-c1cn2cccnc2n1