Reaction Details
TargetN-formyl peptide receptor 2
LigandBDBM37701
Substrate/Competitorn/a
Meas. Tech.Formylpeptide Receptor (FPRL1) Ligand Structure Activity Relationship (SAR) Analysis : Dose Response Assay
IC50>50000±n/a nM
Citation PubChem, PC Formylpeptide Receptor (FPRL1) Ligand Structure Activity Relationship (SAR) Analysis : Dose Response Assay PubChem Bioassay(2007)[AID]
 
N-formyl peptide receptor 2
Name:N-formyl peptide receptor 2
Type:G Protein-Coupled Receptor (GPCR)
Mol. Mass.:38968.35
Organism:Homo sapiens (Human)
Description:P25090
Residue:351
BDBM37701
NameBDBM37701
Synonyms:4-(3,4-dimethoxyphenyl)-2-(4-phenyl-1-piperazinyl)-6-(trifluoromethyl)pyrimidine 4-(3,4-dimethoxyphenyl)-2-(4-phenylpiperazino)-6-(trifluoromethyl)pyrimidine SMR000022330 | cid_3237714
TypeSmall organic molecule
Emp. Form.C23H23F3N4O2
Mol. Mass.444.4495
SMILESCOc1ccc(cc1OC)-c1cc(nc(n1)N1CCN(CC1)c1ccccc1)C(F)(F)F