Reaction Details
TargetN-formyl peptide receptor 2
LigandBDBM40746
Substrate/Competitorn/a
Meas. Tech.Formylpeptide Receptor (FPRL1) Ligand Structure Activity Relationship (SAR) Analysis : Dose Response Assay
IC50>57500±n/a nM
Citation PubChem, PC Formylpeptide Receptor (FPRL1) Ligand Structure Activity Relationship (SAR) Analysis : Dose Response Assay PubChem Bioassay(2007)[AID]
 
N-formyl peptide receptor 2
Name:N-formyl peptide receptor 2
Type:G Protein-Coupled Receptor (GPCR)
Mol. Mass.:38968.35
Organism:Homo sapiens (Human)
Description:P25090
Residue:351
BDBM40746
NameBDBM40746
Synonyms:2,2,2-trifluoro-1-[4-(4-phenyl-2-quinazolinyl)-1-piperazinyl]ethanone 2,2,2-trifluoro-1-[4-(4-phenylquinazolin-2-yl)piperazino]ethanone UNM000003650701 | cid_1145410
TypeSmall organic molecule
Emp. Form.C20H17F3N4O
Mol. Mass.386.3704
SMILESFC(F)(F)C(=O)N1CCN(CC1)c1nc(-c2ccccc2)c2ccccc2n1