Reaction Details
TargetBeta-hexosaminidase subunit beta
LigandBDBM40759
Substrate/Competitorn/a
Meas. Tech.Inhibition Assay
Ki 240±0.0 nM
Citation Liu, JShikhman, ARLotz, MKWong, CH Hexosaminidase inhibitors as new drug candidates for the therapy of osteoarthritis. Chem Biol8:701-11 (2001) 
 
Beta-hexosaminidase subunit beta
Name:Beta-hexosaminidase subunit beta
Type:Enzyme
Mol. Mass.:63112.58
Organism:Homo sapiens (Human)
Description:P07686
Residue:556
BDBM40759
NameBDBM40759
Synonyms:Iminocyclitol, 1
TypeSmall organic molecule
Emp. Form.C7H14N2O4
Mol. Mass.190.1971
SMILESCC(=O)N[C@@H]1N[C@H](CO)[C@@H](O)[C@@H]1O