Reaction Details
TargetBeta-hexosaminidase subunit beta
LigandBDBM40766
Substrate/Competitorn/a
Meas. Tech.Inhibition Assay
Ki 11000±0.0 nM
Citation Liu, JShikhman, ARLotz, MKWong, CH Hexosaminidase inhibitors as new drug candidates for the therapy of osteoarthritis. Chem Biol8:701-11 (2001) 
 
Beta-hexosaminidase subunit beta
Name:Beta-hexosaminidase subunit beta
Type:Enzyme
Mol. Mass.:63112.58
Organism:Homo sapiens (Human)
Description:P07686
Residue:556
BDBM40766
NameBDBM40766
Synonyms:Iminocyclitol, 9
TypeSmall organic molecule
Emp. Form.C8H13NO4S
Mol. Mass.219.258
SMILESCC1NC2C(OC(CO)C(O)C2=O)S1