Reaction Details
TargetHIV-1 protease
LigandBDBM40774
Substrate/Competitorn/a
Meas. Tech.Enzyme Inhibition Assay
Ki 3.8±0.0 nM
Citation Chen, CASieburth, SMGlekas, AHewitt, GWTrainor, GLErickson-Viitanen, SGarber, SSCordova, BJeffry, SKlabe, RM Drug design with a new transition state analog of the hydrated carbonyl: silicon-based inhibitors of the HIV protease. Chem Biol8:1161-6 (2001) 
 
HIV-1 protease
Name:HIV-1 protease
Synonyms:HIV-1 protease wild type
Type:Protein
Mol. Mass.:10757.68
Organism:Human immunodeficiency virus
Description:O90785
Residue:99
BDBM40774
NameBDBM40774
Synonyms:Carbinol, 18b
TypeSmall organic molecule
Emp. Form.C39H42N2O5
Mol. Mass.618.7612
SMILESOC(C[C@@H](Cc1ccccc1)C(=O)NC1C(O)Cc2ccccc12)C[C@@H](Cc1ccccc1)C(=O)NC1C(O)Cc2ccccc12